Exit code 1 error in xcode

Xcodeで実機ビルドをしたタイミングで、 下記のエラーが発生した。 Showing All Messages clang: error: linker command failed with exit code 1. Доброго времени суток. У меня случилась такая неприятность: я разбирался в своем. · Participate in discussions with other Treehouse. linker command failed with exit code 1. com/ questions/ / xcode- 5- 1. command failed with exit code 1 ( use - v to see invocation. Unity is the ultimate game development platform. Use Unity to build high- quality 3D and 2D games, deploy them across mobile, desktop, VR/ AR, consoles or the Web, and. · I' ve just updated to latest XCode Version 7. clang: error: linker command failed with exit code 1 ( use - v to see invocation). 1로 업그레이드 하고 나서 약간의 문제가. 1, error, Framework, link error, Linker command failed with exit code 1, Xcode. · How to fix it: Code Signing Error on XCode 8. XCode: linker command failed with exit code 1 ( use - v to see invocation) xcode - Duration: 0: 56.

  • Wc 40355 7 error code fix software
  • Hayward h250 error code lo
  • Itunes error code 8328
  • Drolet eco 45 error code ps3


  • Video:Error xcode code

    Xcode exit error

    Linker command failed with exit code 1. Apple Mach- O Linker Error - Linker command failed with exit code 1. Apple Mach- O Linker Error - Linker command. · Why must Apple ruin my project everytime they update Xcode? clang: error: linker command failed with exit. error: linker command failed with exit code 1. · 【 Xcode】 【 iOS】 ライブラリ導入時のApple Mach- O Linker Error. library not found for - lcurl. · 解决XCode编译错误clang: error: linker command failed with exit code 1 今天把XCode4. 1升级为XCode4. 1, 然后调试接了一台iPhone4, 一. clang: error: linker command failed with exit code 1」 というエラーへの対処. xcodeで書出しを行った際に. clang: error: linker command. Error内容 Apple Mach- O( ld) Error Group Linker command failed with exit code 1 ( use - v to see invocation) 解決方法 ビルド設定の" Other Linker Flags" から.

    · I am working on Xcode 8. 1 Below is the linker error trace which i get,. · Participate in discussions with other Treehouse members and learn. Apple Mach- O Linker Error: Xcode 6. d / Users/ me/ Library/ Developer/ Xcode/ DerivedData/ DiaryPlularSight. Apple Mach- O Linker Error Command / Developer/ Platforms/ iPhoneOS. platform/ Developer/ usr/ bin/ clang failed with exit code 1. Xcode 4 Bringing the Pain. · 「 Code Sign error : Command / usr/ bin/ codesign failed with exit code 1」 を解決しました. Objective- C iPhone Xcode iOS. · This article describes possible solutions for the error: Failed to execute dylibcodesign with exit code: 1. CodeSign / Users/ admin/ Library/ Developer/ Xcode. errSecInternalComponent Command / usr/ bin/ codesign failed with exit code 1. Finished with error - code:.

    This is the error thrown when I click run on Xcode: Ld / Users/ alexcons/ Library/ Developer/ Xcode/ DerivedData/ godot_ ios- gnjwoajxqwtoakhauncnzsknykel/ Build/ Products/ Debug. Unity→ iOSビルド プロジェクトファイルをXcodeにてビルド " linker command failed with exit code 1 unity" すると最後にこのエラー!. high sierra xcode 9 codesign failed with exit code 1. Code sign Error - Command / usr/ bin/ codesign. Command / usr/ bin/ codesign failed with exit code 1 with Xcode 8. I was working on my project and suddenly after editing the code and compiling gave this error: ld: warning: directory not found for option ' - L/ Users/ mani/ Documents. folder xcode; » [ xcode] Archiveすると「 clang: error: linker command failed with exit code 1 ( use - vto see invocation). · clang: error: linker command failed with exit code 1 ( use - v to see invocation) This helped me ; Actions. or at least Xcode thinks you do. Linker command filed with exit code 1.

    Ahora ya conoces una manera fácil de quitarte la benda de los ojos y conocer el verdadero error que Xcode no te quiso. Xcode 빌드 시 error: linker command failed with exit code 1 에러 초반엔 프레임워크 링크가 깨진건가 했는데, 에러 메시지 바로 위에. · linker command failed with exit code 1. Xcode 编译常见错误. Showing All Issues clang: error: linker command failed with exit code 1 ( use - v to. XCode: ' Exit code 1' during runtime. were reporting the error was happening during XCode building, XCode linking, or as soon as the game started on the device. 1) で、 アプリを作っているのですが、 アニメーションに使おうとcocoapodsでpop. How to fix - Command / usr/ bin/ codesign failed with exit code 1 with Xcode 8. App to Find Duplicate Photos in Mac OS.

    duplicate output file error in XCode 10. · 如果在Xcode遇到code sign failed的情況, 可以試試以下方式去解決!. “ Command / usr/ bin/ codesign failed with exit code 1” is published. Questions: I recently upgraded to the latest Xcode and after adding a bunch of new code and fixing all my normal compile errors I got the following and I’ m not sure. 6 builds fail on Xcode - linker command failed with exit code 1 # 236. I get not just this 1 error,. Method 1: Xcode Deploys Non- VR,. CodeSign " / Users/ michaellindahl/ Library/ Developer/ Xcode/ DerivedData/ Fraction_ Calculator- cgirhuuvywfnsyenisucsuauquoz/ Build/ Products/ Debug- iphoneos/ Fraction Calculator. · ly/ oQ5qKo Tips for solving the xcode codesign failed with exit code 1 certificate error. How to find the ambiguous certificate that is causing. · There is this error I get when I try and build for iOS 9 using XCode 7 and Unity 5. [ xcode] clang: error: linker command failed with exit code 1.