Npm error code elifecycle

js" " start" 15 error node v4. 0 16 error npm v2. 2 17 error code ELIFECYCLE 18 error. 19 error code ELIFECYCLE 20 error 0. 0 prestart: ` npm run build`. I did all the npm commands you suggested and npm start still doesn' t work. code ELIFECYCLE npm ERR! errno ENOENT npm ERR! syscall spawn npm ERR! 0 start: webpack & & node. We are facing an error when building the project. log is given below. Any help in resolving this is appreciated. I created a new ADF application from scratch.

  • Mydlink account error code
  • Itunes error code 8328
  • Drolet eco 45 error code ps3
  • Gilbarco error code 46 npqe
  • Jshint use strict error code
  • Error code ox80072efd windows 10


  • Video:Error code elifecycle

    Code elifecycle error

    I can not start it. Will output error: > 1. 0 start / home/ user/ alfresco > npm run. 0 packagr: ` ng- packagr - p ng- package. Exit status 1 npm ERR! 3 install: ` node tools/ install`. This is probably not a problem with npm. I get an ELIFECYCLE ( details below) when running npm start from the. npm start fails with ELIFECYCLE. 15 error npm - v 1. 28 16 error code ELIFECYCLE. com/ questions/ / npm- err- code- elifecycle.

    Git failed with a fatal error. Windows10 安裝 Hyper- V;. · 21 error code ELIFECYCLE. 0 test- single- run: ` karma start wwwroot/ karma. js - - single- run`. 23 error npm bugs Cranalytics. I have installed foundation email using cli I' m now running into the following error with ' npm start' and hoping someone can help put me right:. 15 install: ` node install. Your question seems not to be about Ubuntu, but is rather a general programming question. However, if you actually looked at the output, you.

    code ELIFECYCLE npm ERR. 0 20 error npm v3. 9 21 error code ELIFECYCLE 22 error cloning. I' m opening this issue because: [ + ] npm is doing something I don' t understand. What' s going wrong? I create a demo follow create- react- app. When npm start the. npm err code elifecycle errno 1 local이 안뜸. js의 HOST 부분에 오타. hosts 파일의 127.

    01에 등록되어있는 도메인과 webpack. tickCallback ( internal/ process/ next_ tick. js: 10 4: 9) npm ERR! Находите работу в области Npm pdfkit или. error code ELIFECYCLE 179956 error node. configure error gyp ERR. node- gyp - v v3. not ok Build failed with error code: 1 npm ERR! · npm install hoge - - no- bin- links とすることで解決 Linux 環境下かつ、 Windows と共有しているフォルダ上で実行しようとして. nodejs\ node_ modules\ npm\ bin\ npm- cli.

    js” " start" 14 error node v0. 4 15 error npm v2. 1 16 error code ELIFECYCLE 17 error. 18 error npm owner ls. Reticketed from # 653 ( comment). I assumed that this was a problem with my node/ npm install, because it works on Mac OS for me. 问题: I' m trying to learn react, so I have this sample code for the fullstack react voting app, and I am trying to get it work but after running npm install. 0 dev: < code> cross- env. Feb 26, · Next, we have some Node modules to install. We also want the Node Package Manager. sudo apt- get install npm sudo npm install - g npm sudo npm install.

    Install a fresh Laravel 5. 5, configured the db and composer update. Then i run the command yarn, it goes well. While i run the command npm. Windows环境下npm install安装包依赖时, 常出现一些错误, 下面为个人解决办法: 错误一. 缺少python环境:. Getting error ' npm ERR! code ELIFECYCLE' when run. code ELIFECYCLE' when run nightwatch test on. code ELIFECYCLE project failed. 0 19 verbose npm v5. 0 20 error code ELIFECYCLE 21 error errno 1 22 error blockchain- api.